Reaction Details
TargetD(2) dopamine receptor
LigandBDBM50323040
Substrate/Competitorn/a
Meas. Tech.ChEMBL_643609 (CHEMBL1212473)
IC50>10000±n/a nM
Citation Gattinoni, SSimone, CDDallavalle, SFezza, FNannei, RBattista, NMinetti, PQuattrociocchi, GCaprioli, ABorsini, FCabri, WPenco, SMerlini, LMaccarrone, M A new group of oxime carbamates as reversible inhibitors of fatty acid amide hydrolase. Bioorg Med Chem Lett20:4406-11 (2010) 
 
D(2) dopamine receptor
Name:D(2) dopamine receptor
Type:Cell-surface receptors
Mol. Mass.:50647.10
Organism:Homo sapiens (Human)
Description:P14416
Residue:443
BDBM50323040
NameBDBM50323040
Synonyms:1-(3-Thiophen-2-yl-phenyl)-ethanone, O-(phenylaminocarbonyl)oxime | CHEMBL1210154
TypeSmall organic molecule
Emp. Form.C19H16N2O2S
Mol. Mass.336.408
SMILESCC(=NOC(=O)Nc1ccccc1)c1cccc(c1)-c1cccs1