Reaction Details
TargetFatty-acid amide hydrolase 1
LigandBDBM50323041
Substrate/Competitorn/a
Meas. Tech.ChEMBL_643589 (CHEMBL1212453)
IC50>25000±n/a nM
Citation Gattinoni, SSimone, CDDallavalle, SFezza, FNannei, RBattista, NMinetti, PQuattrociocchi, GCaprioli, ABorsini, FCabri, WPenco, SMerlini, LMaccarrone, M A new group of oxime carbamates as reversible inhibitors of fatty acid amide hydrolase. Bioorg Med Chem Lett20:4406-11 (2010) 
 
Fatty-acid amide hydrolase 1
Name:Fatty-acid amide hydrolase 1
Type:Hydrolase; single-pass membrane protein; homodimer
Mol. Mass.:63227.28
Organism:Mus musculus (mouse)
Description:Mouse brain membranes were used in the assay.
Residue:579
BDBM50323041
NameBDBM50323041
Synonyms:1-(3'-Phenylaminocarbonylaminocarbonyl-biphenyl-3-yl)-ethanone, O-(phenylaminocarbonyl)oxime | CHEMBL1210220
TypeSmall organic molecule
Emp. Form.C29H24N4O4
Mol. Mass.492.5253
SMILESCC(=NOC(=O)Nc1ccccc1)c1cccc(c1)-c1cccc(c1)C(=O)NC(=O)Nc1ccccc1