Reaction Details
TargetFatty-acid amide hydrolase 1
LigandBDBM50323045
Substrate/Competitorn/a
Meas. Tech.ChEMBL_643589 (CHEMBL1212453)
IC50>50000±n/a nM
Citation Gattinoni, SSimone, CDDallavalle, SFezza, FNannei, RBattista, NMinetti, PQuattrociocchi, GCaprioli, ABorsini, FCabri, WPenco, SMerlini, LMaccarrone, M A new group of oxime carbamates as reversible inhibitors of fatty acid amide hydrolase. Bioorg Med Chem Lett20:4406-11 (2010) 
 
Fatty-acid amide hydrolase 1
Name:Fatty-acid amide hydrolase 1
Type:Hydrolase; single-pass membrane protein; homodimer
Mol. Mass.:63227.28
Organism:Mus musculus (mouse)
Description:Mouse brain membranes were used in the assay.
Residue:579
BDBM50323045
NameBDBM50323045
Synonyms:1-Biphenyl-3-yl-ethanone, O-(N,N-diphenylaminocarbonyl)oxime | CHEMBL1210153
TypeSmall organic molecule
Emp. Form.C27H22N2O2
Mol. Mass.406.4758
SMILESCC(=NOC(=O)N(c1ccccc1)c1ccccc1)c1cccc(c1)-c1ccccc1