Reaction Details
TargetFatty-acid amide hydrolase 1
LigandBDBM50323058
Substrate/Competitorn/a
Meas. Tech.ChEMBL_643589 (CHEMBL1212453)
IC50 401±n/a nM
Citation Gattinoni, SSimone, CDDallavalle, SFezza, FNannei, RBattista, NMinetti, PQuattrociocchi, GCaprioli, ABorsini, FCabri, WPenco, SMerlini, LMaccarrone, M A new group of oxime carbamates as reversible inhibitors of fatty acid amide hydrolase. Bioorg Med Chem Lett20:4406-11 (2010) 
 
Fatty-acid amide hydrolase 1
Name:Fatty-acid amide hydrolase 1
Type:Hydrolase; single-pass membrane protein; homodimer
Mol. Mass.:63227.28
Organism:Mus musculus (mouse)
Description:Mouse brain membranes were used in the assay.
Residue:579
BDBM50323058
NameBDBM50323058
Synonyms:1-Biphenyl-4-yl-ethanone, O-(1-naphthylaminocarbonyl)oxime | CHEMBL1209976
TypeSmall organic molecule
Emp. Form.C25H20N2O2
Mol. Mass.380.4385
SMILESCC(=NOC(=O)Nc1cccc2ccccc12)c1ccc(cc1)-c1ccccc1