Reaction Details
TargetSerine/threonine-protein kinase PLK1
LigandBDBM50323123
Substrate/Competitorn/a
Meas. Tech.ChEMBL_643706 (CHEMBL1212570)
IC50 1±n/a nM
Citation Rheault, TRDonaldson, KHBadiang-Alberti, JGDavis-Ward, RGAndrews, CWBambal, RJackson, JRCheung, M Heteroaryl-linked 5-(1H-benzimidazol-1-yl)-2-thiophenecarboxamides: potent inhibitors of polo-like kinase 1 (PLK1) with improved drug-like properties. Bioorg Med Chem Lett20:4587-92 (2010) 
 
Serine/threonine-protein kinase PLK1
Name:Serine/threonine-protein kinase PLK1
Type:Serine/threonine-protein kinase
Mol. Mass.:68277.16
Organism:Homo sapiens (Human)
Description:P53350
Residue:603
BDBM50323123
NameBDBM50323123
Synonyms:(R)-3-(1-(2-chlorophenyl)ethoxy)-5-(6-(1-methyl-1H-pyrazol-4-yl)-1H-benzo[d]imidazol-1-yl)thiophene-2-carboxamide | CHEMBL1209843
TypeSmall organic molecule
Emp. Form.C24H20ClN5O2S
Mol. Mass.477.966
SMILESC[C@@H](Oc1cc(sc1C(N)=O)-n1cnc2ccc(cc12)-c1cnn(C)c1)c1ccccc1Cl