Reaction Details
TargetSerine/threonine-protein kinase PLK1
LigandBDBM50323108
Substrate/Competitorn/a
Meas. Tech.ChEMBL_643706 (CHEMBL1212570)
IC50 1±n/a nM
Citation Rheault, TRDonaldson, KHBadiang-Alberti, JGDavis-Ward, RGAndrews, CWBambal, RJackson, JRCheung, M Heteroaryl-linked 5-(1H-benzimidazol-1-yl)-2-thiophenecarboxamides: potent inhibitors of polo-like kinase 1 (PLK1) with improved drug-like properties. Bioorg Med Chem Lett20:4587-92 (2010) 
 
Serine/threonine-protein kinase PLK1
Name:Serine/threonine-protein kinase PLK1
Type:Serine/threonine-protein kinase
Mol. Mass.:68277.16
Organism:Homo sapiens (Human)
Description:P53350
Residue:603
BDBM50323108
NameBDBM50323108
Synonyms:(R)-5-(5-(2-aminopyridin-4-yl)-1H-benzo[d]imidazol-1-yl)-3-(1-(2-(trifluoromethyl)phenyl)ethoxy)thiophene-2-carboxamide | CHEMBL1208835
TypeSmall organic molecule
Emp. Form.C26H20F3N5O2S
Mol. Mass.523.53
SMILESC[C@@H](Oc1cc(sc1C(N)=O)-n1cnc2cc(ccc12)-c1ccnc(N)c1)c1ccccc1C(F)(F)F