Reaction Details
TargetSerine/threonine-protein kinase PLK3
LigandBDBM50323109
Substrate/Competitorn/a
Meas. Tech.ChEMBL_643707 (CHEMBL1212571)
IC50 6±n/a nM
Citation Rheault, TRDonaldson, KHBadiang-Alberti, JGDavis-Ward, RGAndrews, CWBambal, RJackson, JRCheung, M Heteroaryl-linked 5-(1H-benzimidazol-1-yl)-2-thiophenecarboxamides: potent inhibitors of polo-like kinase 1 (PLK1) with improved drug-like properties. Bioorg Med Chem Lett20:4587-92 (2010) 
 
Serine/threonine-protein kinase PLK3
Name:Serine/threonine-protein kinase PLK3
Type:Serine/threonine-protein kinase
Mol. Mass.:71655.17
Organism:Homo sapiens (Human)
Description:Enzyme assays were using PLK3 purified from baculovirus-infected Trichoplusia ni cells expressing full-length PLK3.
Residue:646
BDBM50323109
NameBDBM50323109
Synonyms:(R)-3-(1-(2-chlorophenyl)ethoxy)-5-(5-(1-methyl-1H-pyrazol-4-yl)-1H-benzo[d]imidazol-1-yl)thiophene-2-carboxamide | CHEMBL1209842
TypeSmall organic molecule
Emp. Form.C24H20ClN5O2S
Mol. Mass.477.966
SMILESC[C@@H](Oc1cc(sc1C(N)=O)-n1cnc2cc(ccc12)-c1cnn(C)c1)c1ccccc1Cl