Reaction Details
TargetSmoothened homolog
LigandBDBM50323146
Substrate/Competitorn/a
Meas. Tech.ChEMBL_643730 (CHEMBL1212594)
IC50 3±n/a nM
Citation Kaizerman, JAAaron, WAn, SAustin, RBrown, MChong, AHuang, THungate, RJiang, BJohnson, MGLee, GLucas, BSOrf, JRong, MToteva, MMWickramasinghe, DXu, GYe, QZhong, WMcMinn, DL Addressing PXR liabilities of phthalazine-based hedgehog/smoothened antagonists using novel pyridopyridazines. Bioorg Med Chem Lett20:4607-10 (2010) 
 
Smoothened homolog
Name:Smoothened homolog
Type:PROTEIN
Mol. Mass.:87472.73
Organism:Mus musculus
Description:ChEMBL_1510377
Residue:793
BDBM50323146
NameBDBM50323146
Synonyms:(R)-(3-methyl-4-(1-phenylpyrido[3,4-d]pyridazin-4-yl)piperazin-1-yl)(phenyl)methanone | CHEMBL1209454
TypeSmall organic molecule
Emp. Form.C25H23N5O
Mol. Mass.409.483
SMILESC[C@@H]1CN(CCN1c1nnc(-c2ccccc2)c2ccncc12)C(=O)c1ccccc1