Reaction Details
TargetSmoothened homolog
LigandBDBM50323147
Substrate/Competitorn/a
Meas. Tech.ChEMBL_643731 (CHEMBL1212595)
IC50 1±n/a nM
Citation Kaizerman, JAAaron, WAn, SAustin, RBrown, MChong, AHuang, THungate, RJiang, BJohnson, MGLee, GLucas, BSOrf, JRong, MToteva, MMWickramasinghe, DXu, GYe, QZhong, WMcMinn, DL Addressing PXR liabilities of phthalazine-based hedgehog/smoothened antagonists using novel pyridopyridazines. Bioorg Med Chem Lett20:4607-10 (2010) 
 
Smoothened homolog
Name:Smoothened homolog
Type:Protein
Mol. Mass.:86415.51
Organism:Homo sapiens (Human)
Description:Q99835
Residue:787
BDBM50323147
NameBDBM50323147
Synonyms:(R)-(3-methyl-4-(1-(4-(trifluoromethyl)phenyl)pyrido[3,4-d]pyridazin-4-yl)piperazin-1-yl)(phenyl)methanone | CHEMBL1209455
TypeSmall organic molecule
Emp. Form.C26H22F3N5O
Mol. Mass.477.481
SMILESC[C@@H]1CN(CCN1c1nnc(-c2ccc(cc2)C(F)(F)F)c2ccncc12)C(=O)c1ccccc1