Reaction Details
TargetMetabotropic glutamate receptor 5
LigandBDBM50323308
Substrate/Competitorn/a
Meas. Tech.ChEMBL_643903 (CHEMBL1211802)
Ki 102±n/a nM
Citation Felts, ASLindsley, SRLamb, JPRodriguez, ALMenon, UNJadhav, SJones, CKConn, PJLindsley, CWEmmitte, KA 3-Cyano-5-fluoro-N-arylbenzamides as negative allosteric modulators of mGlu(5): Identification of easily prepared tool compounds with CNS exposure in rats. Bioorg Med Chem Lett20:4390-4 (2010) 
 
Metabotropic glutamate receptor 5
Name:Metabotropic glutamate receptor 5
Type:Enzyme
Mol. Mass.:131900.14
Organism:Rattus norvegicus (Rat)
Description:P31424
Residue:1203
BDBM50323308
NameBDBM50323308
Synonyms:3-cyano-5-fluoro-N-(4-methylthiazol-2-yl)benzamide | CHEMBL1209201
TypeSmall organic molecule
Emp. Form.C12H8FN3OS
Mol. Mass.261.275
SMILESCc1csc(NC(=O)c2cc(F)cc(c2)C#N)n1