Reaction Details
TargetMetabotropic glutamate receptor 5
LigandBDBM50323289
Substrate/Competitorn/a
Meas. Tech.ChEMBL_643903 (CHEMBL1211802)
Ki 206±n/a nM
Citation Felts, ASLindsley, SRLamb, JPRodriguez, ALMenon, UNJadhav, SJones, CKConn, PJLindsley, CWEmmitte, KA 3-Cyano-5-fluoro-N-arylbenzamides as negative allosteric modulators of mGlu(5): Identification of easily prepared tool compounds with CNS exposure in rats. Bioorg Med Chem Lett20:4390-4 (2010) 
 
Metabotropic glutamate receptor 5
Name:Metabotropic glutamate receptor 5
Type:Enzyme
Mol. Mass.:131900.14
Organism:Rattus norvegicus (Rat)
Description:P31424
Residue:1203
BDBM50323289
NameBDBM50323289
Synonyms:CHEMBL1209202 | N-(3-chlorophenyl)-3-cyano-5-fluorobenzamide
TypeSmall organic molecule
Emp. Form.C14H8ClFN2O
Mol. Mass.274.678
SMILESFc1cc(cc(c1)C(=O)Nc1cccc(Cl)c1)C#N