Reaction Details
TargetCytochrome P450 11B2, mitochondrial
LigandBDBM50323343
Substrate/Competitorn/a
Meas. Tech.ChEMBL_643964 (CHEMBL1211863)
IC50 5.2±n/a nM
Citation Adams, CMHu, CWJeng, AYKarki, RKsander, GLasala, DLeung-Chu, JLiang, GLiu, QMeredith, ERao, CRigel, DFShi, JSmith, SSpringer, CZhang, C The discovery of potent inhibitors of aldosterone synthase that exhibit selectivity over 11-beta-hydroxylase. Bioorg Med Chem Lett20:4324-7 (2010) 
 
Cytochrome P450 11B2, mitochondrial
Name:Cytochrome P450 11B2, mitochondrial
Type:Protein
Mol. Mass.:57582.15
Organism:Homo sapiens (Human)
Description:P19099
Residue:503
BDBM50323343
NameBDBM50323343
Synonyms:6-(4-Chloro-benzyl)-4-isobutyl-6,7-dihydro-5-thia-2,3a,6-triaza-indene 5,5-dioxide | CHEMBL1209553
TypeSmall organic molecule
Emp. Form.C16H20ClN3O2S
Mol. Mass.353.867
SMILESCC(C)CC1n2cncc2CN(Cc2ccc(Cl)cc2)S1(=O)=O