Reaction Details
TargetCytochrome P450 11B2, mitochondrial
LigandBDBM50323355
Substrate/Competitorn/a
Meas. Tech.ChEMBL_643964 (CHEMBL1211863)
IC50 0.9±n/a nM
Citation Adams, CMHu, CWJeng, AYKarki, RKsander, GLasala, DLeung-Chu, JLiang, GLiu, QMeredith, ERao, CRigel, DFShi, JSmith, SSpringer, CZhang, C The discovery of potent inhibitors of aldosterone synthase that exhibit selectivity over 11-beta-hydroxylase. Bioorg Med Chem Lett20:4324-7 (2010) 
 
Cytochrome P450 11B2, mitochondrial
Name:Cytochrome P450 11B2, mitochondrial
Type:Protein
Mol. Mass.:57582.15
Organism:Homo sapiens (Human)
Description:P19099
Residue:503
BDBM50323355
NameBDBM50323355
Synonyms:6-[(S)-1-(4-Chloro-phenyl)-ethyl]-4-(2-methoxy-2-methyl-propyl)-6,7-dihydro-5-thia-2,3a,6-triaza-indene 5,5-dioxide | CHEMBL1209693
TypeSmall organic molecule
Emp. Form.C18H24ClN3O3S
Mol. Mass.397.919
SMILESCOC(C)(C)CC1n2cncc2CN([C@@H](C)c2ccc(Cl)cc2)S1(=O)=O