Reaction Details
TargetHydroxycarboxylic acid receptor 2
LigandBDBM50323399
Substrate/Competitorn/a
Meas. Tech.ChEMBL_644014 (CHEMBL1211913)
IC50 3400±n/a nM
Citation Imbriglio, JEChang, SLiang, RRaghavan, SSchmidt, DSmenton, ATria, SSchrader, TOJung, JKEsser, CHolt, TGWolff, MSTaggart, AKCheng, KCarballo-Jane, EWaters, MGTata, JRColletti, SL GPR109a agonists. Part 2: pyrazole-acids as agonists of the human orphan G-protein coupled receptor GPR109a. Bioorg Med Chem Lett20:4472-4 (2010) 
 
Hydroxycarboxylic acid receptor 2
Name:Hydroxycarboxylic acid receptor 2
Type:PROTEIN
Mol. Mass.:41418.01
Organism:Mus musculus
Description:ChEMBL_820676
Residue:360
BDBM50323399
NameBDBM50323399
Synonyms:5-(1H-pyrazol-1-yl)-1,4,5,6-tetrahydrocyclopenta[c]pyrazole-3-carboxylic acid | CHEMBL1208987
TypeSmall organic molecule
Emp. Form.C10H10N4O2
Mol. Mass.218.212
SMILESOC(=O)c1n[nH]c2CC(Cc12)n1cccn1