Reaction Details
TargetHydroxycarboxylic acid receptor 2
LigandBDBM50273099
Substrate/Competitorn/a
Meas. Tech.ChEMBL_644015 (CHEMBL1211914)
IC50 1500±n/a nM
Citation Imbriglio, JEChang, SLiang, RRaghavan, SSchmidt, DSmenton, ATria, SSchrader, TOJung, JKEsser, CHolt, TGWolff, MSTaggart, AKCheng, KCarballo-Jane, EWaters, MGTata, JRColletti, SL GPR109a agonists. Part 2: pyrazole-acids as agonists of the human orphan G-protein coupled receptor GPR109a. Bioorg Med Chem Lett20:4472-4 (2010) 
 
Hydroxycarboxylic acid receptor 2
Name:Hydroxycarboxylic acid receptor 2
Type:G Protein-Coupled Receptor (GPCR)
Mol. Mass.:41868.22
Organism:Homo sapiens (Human)
Description:Membranes from CHO cells expressing the recombinant human GPR109A were used in competition binding assay.
Residue:363
BDBM50273099
NameBDBM50273099
Synonyms:3-(1H-tetrazol-5-yl)-1,4,5,6-tetrahydrocyclopenta[c]pyrazole CHEMBL456145 | MK-0354
TypeSmall organic molecule
Emp. Form.C7H8N6
Mol. Mass.176.1786
SMILESC1Cc2[nH]nc(c2C1)-c1nnn[nH]1