Reaction Details
TargetHydroxycarboxylic acid receptor 2
LigandBDBM50323398
Substrate/Competitorn/a
Meas. Tech.ChEMBL_644015 (CHEMBL1211914)
IC50 390±n/a nM
Citation Imbriglio, JEChang, SLiang, RRaghavan, SSchmidt, DSmenton, ATria, SSchrader, TOJung, JKEsser, CHolt, TGWolff, MSTaggart, AKCheng, KCarballo-Jane, EWaters, MGTata, JRColletti, SL GPR109a agonists. Part 2: pyrazole-acids as agonists of the human orphan G-protein coupled receptor GPR109a. Bioorg Med Chem Lett20:4472-4 (2010) 
 
Hydroxycarboxylic acid receptor 2
Name:Hydroxycarboxylic acid receptor 2
Type:G Protein-Coupled Receptor (GPCR)
Mol. Mass.:41868.22
Organism:Homo sapiens (Human)
Description:Membranes from CHO cells expressing the recombinant human GPR109A were used in competition binding assay.
Residue:363
BDBM50323398
NameBDBM50323398
Synonyms:5-(1-methyl-1H-pyrazol-5-yl)-1,4,5,6-tetrahydrocyclopenta[c]pyrazole-3-carboxylic acid | CHEMBL1208986
TypeSmall organic molecule
Emp. Form.C11H12N4O2
Mol. Mass.232.2386
SMILESCn1nccc1C1Cc2[nH]nc(C(O)=O)c2C1