Reaction Details
TargetSmoothened homolog
LigandBDBM50323405
Substrate/Competitorn/a
Meas. Tech.ChEMBL_644050 (CHEMBL1211949)
IC50 20±n/a nM
Citation Li, JJShanmugasundaram, VReddy, SFleischer, LLWang, ZSmith, YHarter, WGYue, WSSwaroop, MLi, LJi, CXDettling, DOsak, BFitzgerald, LRConradi, R Smoothened antagonists for hair inhibition. Bioorg Med Chem Lett20:4932-5 (2010) 
 
Smoothened homolog
Name:Smoothened homolog
Type:Protein
Mol. Mass.:86415.51
Organism:Homo sapiens (Human)
Description:Q99835
Residue:787
BDBM50323405
NameBDBM50323405
Synonyms:1-((1-(4-fluorophenyl)-3,5-dimethyl-1H-pyrazol-4-yl)methyl)-4-(3-methoxyphenyl)piperazine | CHEMBL1209048
TypeSmall organic molecule
Emp. Form.C23H27FN4O
Mol. Mass.394.4851
SMILESCOc1cccc(c1)N1CCN(Cc2c(C)nn(c2C)-c2ccc(F)cc2)CC1