Reaction Details
TargetD(4) dopamine receptor
LigandBDBM50323401
Substrate/Competitorn/a
Meas. Tech.ChEMBL_644069 (CHEMBL1211968)
Ki>1000±n/a nM
Citation Li, JJShanmugasundaram, VReddy, SFleischer, LLWang, ZSmith, YHarter, WGYue, WSSwaroop, MLi, LJi, CXDettling, DOsak, BFitzgerald, LRConradi, R Smoothened antagonists for hair inhibition. Bioorg Med Chem Lett20:4932-5 (2010) 
 
D(4) dopamine receptor
Name:D(4) dopamine receptor
Type:Enzyme
Mol. Mass.:48373.19
Organism:Homo sapiens (Human)
Description:P21917
Residue:419
BDBM50323401
NameBDBM50323401
Synonyms:4-((3-(2-fluoro-6-methoxyphenoxy)azetidin-1-yl)methyl)-5-methyl-1-phenyl-1H-pyrazole | CHEMBL1209158
TypeSmall organic molecule
Emp. Form.C21H22FN3O2
Mol. Mass.367.4167
SMILESCOc1cccc(F)c1OC1CN(Cc2cnn(c2C)-c2ccccc2)C1