Reaction Details
TargetMitogen-activated protein kinase 14
LigandBDBM50323412
Substrate/Competitorn/a
Meas. Tech.ChEMBL_644072 (CHEMBL1211971)
IC50 2850±n/a nM
Citation Liu, HKuhn, CFeru, FJacques, SLDeshmukh, GDYe, PRennie, GRJohnson, TKazmirski, SLow, SColi, RDing, YHCheng, ACTecle, HEnglish, JMStanton, RWu, JC Enhanced selectivity profile of pyrazole-urea based DFG-out p38alpha inhibitors. Bioorg Med Chem Lett20:4885-91 (2010) 
 
Mitogen-activated protein kinase 14
Name:Mitogen-activated protein kinase 14
Type:Serine/threonine-protein kinase
Mol. Mass.:41286.76
Organism:Homo sapiens (Human)
Description:Q16539
Residue:360
BDBM50323412
NameBDBM50323412
Synonyms:1-(1-(3-(aminomethyl)phenyl)-3-tert-butyl-1H-pyrazol-5-yl)-3-phenylurea | CHEMBL1209212
TypeSmall organic molecule
Emp. Form.C21H25N5O
Mol. Mass.363.4561
SMILESCC(C)(C)c1cc(NC(=O)Nc2ccccc2)n(n1)-c1cccc(CN)c1