Reaction Details
TargetMitogen-activated protein kinase 14
LigandBDBM50323419
Substrate/Competitorn/a
Meas. Tech.ChEMBL_644072 (CHEMBL1211971)
IC50 38±n/a nM
Citation Liu, HKuhn, CFeru, FJacques, SLDeshmukh, GDYe, PRennie, GRJohnson, TKazmirski, SLow, SColi, RDing, YHCheng, ACTecle, HEnglish, JMStanton, RWu, JC Enhanced selectivity profile of pyrazole-urea based DFG-out p38alpha inhibitors. Bioorg Med Chem Lett20:4885-91 (2010) 
 
Mitogen-activated protein kinase 14
Name:Mitogen-activated protein kinase 14
Type:Serine/threonine-protein kinase
Mol. Mass.:41286.76
Organism:Homo sapiens (Human)
Description:Q16539
Residue:360
BDBM50323419
NameBDBM50323419
Synonyms:CHEMBL1209342 | N-(2-(3-(3-tert-butyl-5-(3-phenylureido)-1H-pyrazol-1-yl)benzylamino)-2-oxoethyl)-5-methylisoxazole-3-carboxamide
TypeSmall organic molecule
Emp. Form.C28H31N7O4
Mol. Mass.529.5902
SMILESCc1cc(no1)C(=O)NCC(=O)NCc1cccc(c1)-n1nc(cc1NC(=O)Nc1ccccc1)C(C)(C)C