Reaction Details
TargetMitogen-activated protein kinase 14
LigandBDBM50323427
Substrate/Competitorn/a
Meas. Tech.ChEMBL_644072 (CHEMBL1211971)
IC50 16±n/a nM
Citation Liu, HKuhn, CFeru, FJacques, SLDeshmukh, GDYe, PRennie, GRJohnson, TKazmirski, SLow, SColi, RDing, YHCheng, ACTecle, HEnglish, JMStanton, RWu, JC Enhanced selectivity profile of pyrazole-urea based DFG-out p38alpha inhibitors. Bioorg Med Chem Lett20:4885-91 (2010) 
 
Mitogen-activated protein kinase 14
Name:Mitogen-activated protein kinase 14
Type:Serine/threonine-protein kinase
Mol. Mass.:41286.76
Organism:Homo sapiens (Human)
Description:Q16539
Residue:360
BDBM50323427
NameBDBM50323427
Synonyms:CHEMBL1209482 | N-(3-(3-tert-butyl-5-(3-phenylureido)-1H-pyrazol-1-yl)benzyl)-2-(2-oxopyridin-1(2H)-yl)acetamide
TypeSmall organic molecule
Emp. Form.C28H30N6O3
Mol. Mass.498.5762
SMILESCC(C)(C)c1cc(NC(=O)Nc2ccccc2)n(n1)-c1cccc(CNC(=O)Cn2ccccc2=O)c1