Reaction Details
TargetMitogen-activated protein kinase 14
LigandBDBM50323435
Substrate/Competitorn/a
Meas. Tech.ChEMBL_644073 (CHEMBL1211972)
IC50 1100±n/a nM
Citation Liu, HKuhn, CFeru, FJacques, SLDeshmukh, GDYe, PRennie, GRJohnson, TKazmirski, SLow, SColi, RDing, YHCheng, ACTecle, HEnglish, JMStanton, RWu, JC Enhanced selectivity profile of pyrazole-urea based DFG-out p38alpha inhibitors. Bioorg Med Chem Lett20:4885-91 (2010) 
 
Mitogen-activated protein kinase 14
Name:Mitogen-activated protein kinase 14
Type:Serine/threonine-protein kinase
Mol. Mass.:41286.76
Organism:Homo sapiens (Human)
Description:Q16539
Residue:360
BDBM50323435
NameBDBM50323435
Synonyms:(1R)-2-(3-(3-tert-butyl-5-(3-phenylureido)-1H-pyrazol-1-yl)benzylcarbamoyl)cyclopropanecarboxylic acid | CHEMBL1209637
TypeSmall organic molecule
Emp. Form.C26H29N5O4
Mol. Mass.475.5396
SMILESCC(C)(C)c1cc(NC(=O)Nc2ccccc2)n(n1)-c1cccc(CNC(=O)C2C[C@H]2C(O)=O)c1