Reaction Details
TargetMitogen-activated protein kinase 14
LigandBDBM50323414
Substrate/Competitorn/a
Meas. Tech.ChEMBL_644073 (CHEMBL1211972)
IC50 287±n/a nM
Citation Liu, HKuhn, CFeru, FJacques, SLDeshmukh, GDYe, PRennie, GRJohnson, TKazmirski, SLow, SColi, RDing, YHCheng, ACTecle, HEnglish, JMStanton, RWu, JC Enhanced selectivity profile of pyrazole-urea based DFG-out p38alpha inhibitors. Bioorg Med Chem Lett20:4885-91 (2010) 
 
Mitogen-activated protein kinase 14
Name:Mitogen-activated protein kinase 14
Type:Serine/threonine-protein kinase
Mol. Mass.:41286.76
Organism:Homo sapiens (Human)
Description:Q16539
Residue:360
BDBM50323414
NameBDBM50323414
Synonyms:CHEMBL1209214 | methyl 2-(3-(3-tert-butyl-5-(3-phenylureido)-1H-pyrazol-1-yl)benzylamino)-2-oxoethylcarbamate
TypeSmall organic molecule
Emp. Form.C25H30N6O4
Mol. Mass.478.5435
SMILESCOC(=O)NCC(=O)NCc1cccc(c1)-n1nc(cc1NC(=O)Nc1ccccc1)C(C)(C)C