Reaction Details
TargetMitogen-activated protein kinase 14
LigandBDBM50323424
Substrate/Competitorn/a
Meas. Tech.ChEMBL_644073 (CHEMBL1211972)
IC50 1600±n/a nM
Citation Liu, HKuhn, CFeru, FJacques, SLDeshmukh, GDYe, PRennie, GRJohnson, TKazmirski, SLow, SColi, RDing, YHCheng, ACTecle, HEnglish, JMStanton, RWu, JC Enhanced selectivity profile of pyrazole-urea based DFG-out p38alpha inhibitors. Bioorg Med Chem Lett20:4885-91 (2010) 
 
Mitogen-activated protein kinase 14
Name:Mitogen-activated protein kinase 14
Type:Serine/threonine-protein kinase
Mol. Mass.:41286.76
Organism:Homo sapiens (Human)
Description:Q16539
Residue:360
BDBM50323424
NameBDBM50323424
Synonyms:2-acetamido-N-(3-(3-tert-butyl-5-(3-phenylureido)-1H-pyrazol-1-yl)benzyl)-N-methylacetamide | CHEMBL1209406
TypeSmall organic molecule
Emp. Form.C26H32N6O3
Mol. Mass.476.5707
SMILESCN(Cc1cccc(c1)-n1nc(cc1NC(=O)Nc1ccccc1)C(C)(C)C)C(=O)CNC(C)=O