Reaction Details
TargetMelanocortin receptor 4
LigandBDBM50323459
Substrate/Competitorn/a
Meas. Tech.ChEMBL_644082 (CHEMBL1211981)
IC50 2.4±n/a nM
Citation Guo, LYe, ZLiu, JHe, SBakshi, RKSebhat, IKDobbelaar, PHHong, QJian, TDellureficio, JPTsou, NNBall, RGWeinberg, DHMacNeil, TTang, RTamvakopoulos, CPeng, QChen, HYChen, ASMartin, WJMacIntyre, DEStrack, AMFong, TMWyvratt, MJNargund, RP Discovery of potent, selective, and orally bioavailable 3H-spiro[isobenzofuran-1,4'-piperidine] based melanocortin subtype-4 receptor agonists. Bioorg Med Chem Lett20:4895-900 (2010) 
 
Melanocortin receptor 4
Name:Melanocortin receptor 4
Type:Enzyme
Mol. Mass.:36949.50
Organism:Homo sapiens (Human)
Description:P32245
Residue:332
BDBM50323459
NameBDBM50323459
Synonyms:(S)-(6-chloro-3-(2-(3,3-difluoropyrrolidin-1-yl)propan-2-yl)-5-methyl-3H-spiro[isobenzofuran-1,4'-piperidine]-1'-yl)((3S,4R)-4-(2,4-difluorophenyl)-1-(tetrahydro-2H-pyran-4-yl)pyrrolidin-3-yl)methanone | CHEMBL1209802
TypeSmall organic molecule
Emp. Form.C36H44ClF4N3O3
Mol. Mass.678.199
SMILESCc1cc2[C@H](OC3(CCN(CC3)C(=O)[C@@H]3CN(C[C@H]3c3ccc(F)cc3F)C3CCOCC3)c2cc1Cl)C(C)(C)N1CCC(F)(F)C1