Reaction Details
TargetHigh affinity choline transporter 1
LigandBDBM50416489
Substrate/Competitorn/a
Meas. Tech.ChEMBL_644789 (CHEMBL1211032)
Ki 50±n/a nM
Citation Geldenhuys, WJAllen, DDLockman, PR 3-D-QSAR and docking studies on the neuronal choline transporter. Bioorg Med Chem Lett20:4870-7 (2010) 
 
High affinity choline transporter 1
Name:High affinity choline transporter 1
Type:PROTEIN
Mol. Mass.:63358.06
Organism:Mus musculus
Description:ChEMBL_644789
Residue:580
BDBM50416489
NameBDBM50416489
Synonyms:CHEMBL1209507
TypeSmall organic molecule
Emp. Form.C19H26NO3
Mol. Mass.316.4141
SMILESCOc1cc(cc(OC)c1OC)C#CCC[N+]12CCC(CC1)C2