Reaction Details
TargetHigh affinity choline transporter 1
LigandBDBM50416493
Substrate/Competitorn/a
Meas. Tech.ChEMBL_644789 (CHEMBL1211032)
Ki 820351.54±n/a nM
Citation Geldenhuys, WJAllen, DDLockman, PR 3-D-QSAR and docking studies on the neuronal choline transporter. Bioorg Med Chem Lett20:4870-7 (2010) 
 
High affinity choline transporter 1
Name:High affinity choline transporter 1
Type:PROTEIN
Mol. Mass.:63358.06
Organism:Mus musculus
Description:ChEMBL_644789
Residue:580
BDBM50416493
NameBDBM50416493
Synonyms:CHEMBL354077
TypeSmall organic molecule
Emp. Form.C5H7N3
Mol. Mass.109.1292
SMILESNc1ccncc1N