Reaction Details
TargetHigh affinity choline transporter 1
LigandBDBM50204415
Substrate/Competitorn/a
Meas. Tech.ChEMBL_644789 (CHEMBL1211032)
Ki 4700±n/a nM
Citation Geldenhuys, WJAllen, DDLockman, PR 3-D-QSAR and docking studies on the neuronal choline transporter. Bioorg Med Chem Lett20:4870-7 (2010) 
 
High affinity choline transporter 1
Name:High affinity choline transporter 1
Type:PROTEIN
Mol. Mass.:63358.06
Organism:Mus musculus
Description:ChEMBL_644789
Residue:580
BDBM50204415
NameBDBM50204415
Synonyms:1-methyl-1-azonia-bicyclo[2.2.2]octane CHEMBL389799
TypeSmall organic molecule
Emp. Form.C8H16N
Mol. Mass.126.2188
SMILESC[N+]12CCC(CC1)CC2