Reaction Details
TargetHigh affinity choline transporter 1
LigandBDBM10458
Substrate/Competitorn/a
Meas. Tech.ChEMBL_644789 (CHEMBL1211032)
Ki 480839.35±n/a nM
Citation Geldenhuys, WJAllen, DDLockman, PR 3-D-QSAR and docking studies on the neuronal choline transporter. Bioorg Med Chem Lett20:4870-7 (2010) 
 
High affinity choline transporter 1
Name:High affinity choline transporter 1
Type:PROTEIN
Mol. Mass.:63358.06
Organism:Mus musculus
Description:ChEMBL_644789
Residue:580
BDBM10458
NameBDBM10458
Synonyms:4-AP CHEMBL284348 pyridin-4-amine
TypeSmall organic molecule
Emp. Form.C5H6N2
Mol. Mass.94.1145
SMILESNc1ccncc1