Reaction Details
TargetHigh affinity choline transporter 1
LigandBDBM7973
Substrate/Competitorn/a
Meas. Tech.ChEMBL_644789 (CHEMBL1211032)
Ki 150003019.05±n/a nM
Citation Geldenhuys, WJAllen, DDLockman, PR 3-D-QSAR and docking studies on the neuronal choline transporter. Bioorg Med Chem Lett20:4870-7 (2010) 
 
High affinity choline transporter 1
Name:High affinity choline transporter 1
Type:PROTEIN
Mol. Mass.:63358.06
Organism:Mus musculus
Description:ChEMBL_644789
Residue:580
BDBM7973
NameBDBM7973
Synonyms:2-aminoethan-1-ol ethanolamine
TypeSmall organic molecule
Emp. Form.C2H7NO
Mol. Mass.61.0831
SMILESNCCO