Reaction Details
TargetHigh affinity choline transporter 1
LigandBDBM50416501
Substrate/Competitorn/a
Meas. Tech.ChEMBL_644789 (CHEMBL1211032)
Ki 701.46±n/a nM
Citation Geldenhuys, WJAllen, DDLockman, PR 3-D-QSAR and docking studies on the neuronal choline transporter. Bioorg Med Chem Lett20:4870-7 (2010) 
 
High affinity choline transporter 1
Name:High affinity choline transporter 1
Type:PROTEIN
Mol. Mass.:63358.06
Organism:Mus musculus
Description:ChEMBL_644789
Residue:580
BDBM50416501
NameBDBM50416501
Synonyms:CHEMBL1209653
TypeSmall organic molecule
Emp. Form.C19H30NO3
Mol. Mass.320.4459
SMILESCC[N+](CC)(CC)CCC#Cc1cc(OC)c(OC)c(OC)c1