Reaction Details
TargetHigh affinity choline transporter 1
LigandBDBM50416503
Substrate/Competitorn/a
Meas. Tech.ChEMBL_644789 (CHEMBL1211032)
Ki 640.03±n/a nM
Citation Geldenhuys, WJAllen, DDLockman, PR 3-D-QSAR and docking studies on the neuronal choline transporter. Bioorg Med Chem Lett20:4870-7 (2010) 
 
High affinity choline transporter 1
Name:High affinity choline transporter 1
Type:PROTEIN
Mol. Mass.:63358.06
Organism:Mus musculus
Description:ChEMBL_644789
Residue:580
BDBM50416503
NameBDBM50416503
Synonyms:CHEMBL1209713
TypeSmall organic molecule
Emp. Form.C9H18NO
Mol. Mass.156.2448
SMILESOCC[N+]12CCC(CC1)CC2