Reaction Details
TargetHigh affinity choline transporter 1
LigandBDBM50416504
Substrate/Competitorn/a
Meas. Tech.ChEMBL_644789 (CHEMBL1211032)
Ki 230.14±n/a nM
Citation Geldenhuys, WJAllen, DDLockman, PR 3-D-QSAR and docking studies on the neuronal choline transporter. Bioorg Med Chem Lett20:4870-7 (2010) 
 
High affinity choline transporter 1
Name:High affinity choline transporter 1
Type:PROTEIN
Mol. Mass.:63358.06
Organism:Mus musculus
Description:ChEMBL_644789
Residue:580
BDBM50416504
NameBDBM50416504
Synonyms:CHEMBL1209579
TypeSmall organic molecule
Emp. Form.C26H42NO3
Mol. Mass.416.616
SMILESCCCCCCCC[N+]1(CCC#Cc2cc(OC)c(OC)c(OC)c2)CCCCC1