Reaction Details
TargetCannabinoid receptor 1
LigandBDBM50323607
Substrate/Competitorn/a
Meas. Tech.ChEMBL_645041 (CHEMBL1211490)
IC50 0.59±n/a nM
Citation Kopka, IELin, LSJewell, JPLanza, TJFong, TMShen, CPLao, ZJHa, SCastonguay, LGVan der Ploeg, LGoulet, MTHagmann, WK Synthesis and cannabinoid-1 receptor binding affinity of conformationally constrained analogs of taranabant. Bioorg Med Chem Lett20:4757-61 (2010) 
 
Cannabinoid receptor 1
Name:Cannabinoid receptor 1
Type:G Protein-Coupled Receptor (GPCR)
Mol. Mass.:52868.96
Organism:Homo sapiens (Human)
Description:P21554
Residue:472
BDBM50323607
NameBDBM50323607
Synonyms:CHEMBL1209596 | rac-N-((2S,3S)-3-(3-bromophenyl)-4-(4-chlorophenyl)butan-2-yl)-2-methyl-2-(5-(trifluoromethyl)pyridin-2-yloxy)propanamide
TypeSmall organic molecule
Emp. Form.C26H25BrClF3N2O2
Mol. Mass.569.841
SMILESC[C@H](NC(=O)C(C)(C)Oc1ccc(cn1)C(F)(F)F)[C@@H](Cc1ccc(Cl)cc1)c1cccc(Br)c1