Reaction Details
TargetMAP kinase-activated protein kinase 2
LigandBDBM50323635
Substrate/Competitorn/a
Meas. Tech.ChEMBL_645056 (CHEMBL1211562)
Ki 320±n/a nM
Citation Olsson, HSjö, PErsoy, OKristoffersson, ALarsson, JNordén, B 4-Anilino-6-phenyl-quinoline inhibitors of mitogen activated protein kinase-activated protein kinase 2 (MK2). Bioorg Med Chem Lett20:4738-40 (2010) 
 
MAP kinase-activated protein kinase 2
Name:MAP kinase-activated protein kinase 2
Type:Serine/threonine-protein kinase
Mol. Mass.:45579.87
Organism:Homo sapiens (Human)
Description:P49137
Residue:400
BDBM50323635
NameBDBM50323635
Synonyms:6-(4-chlorophenyl)-N-(4-(4-methylpiperazin-1-yl)phenyl)quinolin-4-amine | CHEMBL1208951
TypeSmall organic molecule
Emp. Form.C26H25ClN4
Mol. Mass.428.957
SMILESCN1CCN(CC1)c1ccc(Nc2ccnc3ccc(cc23)-c2ccc(Cl)cc2)cc1