Reaction Details
TargetCarbonic anhydrase 1
LigandBDBM12414
Substrate/Competitorn/a
Meas. Tech.ChEMBL_648755 (CHEMBL666782)
Ki 3300±n/a nM
Citation Tsukiji, SMiyagawa, MTakaoka, YTamura, THamachi, I Ligand-directed tosyl chemistry for protein labeling in vivo. Nat Chem Biol5:341-3 (2009) 
 
Carbonic anhydrase 1
Name:Carbonic anhydrase 1
Type:Enzyme
Mol. Mass.:28873.37
Organism:Homo sapiens (Human)
Description:P00915
Residue:261
BDBM12414
NameBDBM12414
Synonyms:CHEMBL27601 hCA inhibitor, 6
TypeSmall organic molecule
Emp. Form.C6H7NO2S
Mol. Mass.157.19
SMILESNS(=O)(=O)c1ccccc1