Reaction Details
TargetEstrogen receptor
LigandBDBM50323701
Substrate/Competitorn/a
Meas. Tech.ChEMBL_649075 (CHEMBL1218773)
Ki 2±n/a nM
Citation Renner, Svan Otterlo, WADominguez Seoane, MMöcklinghoff, SHofmann, BWetzel, SSchuffenhauer, AErtl, POprea, TISteinhilber, DBrunsveld, LRauh, DWaldmann, H Bioactivity-guided mapping and navigation of chemical space. Nat Chem Biol5:585-92 (2009) 
 
Estrogen receptor
Name:Estrogen receptor
Type:Protein
Mol. Mass.:66230.44
Organism:Homo sapiens (Human)
Description:P03372
Residue:595
BDBM50323701
NameBDBM50323701
Synonyms:2-(Trifluoroacetyl)-1,2,3,4-tetrahydro-6-isoquinolinol | CHEMBL1213617
TypeSmall organic molecule
Emp. Form.C11H10F3NO2
Mol. Mass.245.1978
SMILESOc1ccc2CN(CCc2c1)C(=O)C(F)(F)F