Reaction Details
TargetCoagulation factor X
LigandBDBM50323718
Substrate/Competitorn/a
Meas. Tech.ChEMBL_649131 (CHEMBL1218829)
IC50 93±n/a nM
Citation Huet, TKerbarh, OSchols, DClayette, PGauchet, CDubreucq, GVincent, LBompais, HMazinghien, RQuerolle, OSalvador, ALemoine, JLucidi, BBalzarini, JPetitou, M Long-lasting enfuvirtide carrier pentasaccharide conjugates with potent anti-human immunodeficiency virus type 1 activity. Antimicrob Agents Chemother54:134-42 (2009) 
 
Coagulation factor X
Name:Coagulation factor X
Type:PROTEIN
Mol. Mass.:54498.45
Organism:Bos taurus
Description:ChEMBL_1364435
Residue:492
BDBM50323718
NameBDBM50323718
Synonyms:CHEMBL1213080
TypeSmall organic molecule
Emp. Form.C266H392N53O118S8
Mol. Mass.6476.768
SMILESCC[C@H](C)[C@H](NC(=O)[C@H](CC(C)C)NC(=O)[C@H](CO)NC(=O)[C@H](Cc1cnc[nH]1)NC(=O)[C@@H](NC(=O)[C@H](CC(C)C)NC(=O)[C@H](CO)NC(=O)[C@@H](NC(=O)[C@H](Cc1ccc(O)cc1)NC(=O)C(CSC1CC(=O)N(CCC(=O)NCCOCCOCCOCCOCCC(=O)N[C@@H]2[C@@H](O[C@H]3[C@H](OC)[C@@H](OC)[C@H](O[C@@H]4[C@@H](CS([O-])(=O)=O)O[C@H](O[C@H]5[C@H](OC)[C@@H](OC)[C@H](O[C@H]6[C@H](COS([O-])(=O)=O)O[C@@H](OC)[C@@H](OS([O-])(=O)=O)[C@H]6OS([O-])(=O)=O)O[C@H]5C([O-])=O)[C@H](CS([O-])(=O)=O)[C@H]4CS([O-])(=O)=O)O[C@]3(CC)C([O-])=O)O[C@@H](COS([O-])(=O)=O)[C@H](OC)[C@H]2OC)C1=O)NC(C)=O)[C@@H](C)O)[C@@H](C)CC)C(=O)N[C@@H](CCC(O)=O)C(=O)N[C@@H](CCC(O)=O)C(=O)N[C@@H](CO)C(=O)N[C@@H](CCC(N)=O)C(=O)N[C@@H](CC(N)=O)C(=O)N[C@@H](CCC(N)=O)C(=O)N[C@@H](CCC(N)=O)C(=O)N[C@@H](CCC(O)=O)C(=O)N[C@@H](CC(C)C)C(=O)N[C@@H](CC(N)=O)C(=O)N[C@@H](CCC(O)=O)C(=O)N[C@@H](CCC(N)=O)C(=O)N[C@@H](CCC(O)=O)C(=O)N[C@@H](CC(C)C)C(=O)N[C@@H](CC(C)C)C(=O)N[C@@H](CCC(O)=O)C(=O)N[C@H](CC(C)C)C(=O)N[C@H](CC(O)=O)C(=O)N[C@H](CC(C)C)C(=O)N[C@H](Cc1c[nH]c2ccccc12)C(=O)N[C@H](C)C(=O)N[C@H](CO)C(=O)N[C@H](CC(C)C)C(=O)N[C@H](Cc1c[nH]c2ccccc12)C(=O)N[C@H](CC(N)=O)C(=O)N[C@H](Cc1c[nH]c2ccccc12)C(=O)N[C@H](Cc1ccccc1)C(N)=O