Reaction Details
TargetPhosphatidylinositol 4,5-bisphosphate 3-kinase catalytic subunit gamma isoform
LigandBDBM50323727
Substrate/Competitorn/a
Meas. Tech.ChEMBL_646801 (CHEMBL1216942)
IC50 17000±n/a nM
Citation Berndt, AMiller, SWilliams, OLe, DDHouseman, BTPacold, JIGorrec, FHon, WCLiu, YRommel, CGaillard, PRückle, TSchwarz, MKShokat, KMShaw, JPWilliams, RL The p110 delta structure: mechanisms for selectivity and potency of new PI(3)K inhibitors. Nat Chem Biol6:117-24 (2010) 
 
Phosphatidylinositol 4,5-bisphosphate 3-kinase catalytic subunit gamma isoform
Name:Phosphatidylinositol 4,5-bisphosphate 3-kinase catalytic subunit gamma isoform
Type:Enzyme Subunit
Mol. Mass.:126470.30
Organism:Homo sapiens (Human)
Description:P48736
Residue:1102
BDBM50323727
NameBDBM50323727
Synonyms:2-((9H-purin-6-ylthio)methyl)-5-chloro-3-(2-methoxyphenyl)quinazolin-4(3H)-one | CHEMBL1213083
TypeSmall organic molecule
Emp. Form.C21H15ClN6O2S
Mol. Mass.450.901
SMILESCOc1ccccc1-n1c(CSc2ncnc3nc[nH]c23)nc2cccc(Cl)c2c1=O