Reaction Details
TargetPhosphatidylinositol 4,5-bisphosphate 3-kinase catalytic subunit delta isoform
LigandBDBM50323731
Substrate/Competitorn/a
Meas. Tech.ChEMBL_646802 (CHEMBL1216943)
IC50 1±n/a nM
Citation Berndt, AMiller, SWilliams, OLe, DDHouseman, BTPacold, JIGorrec, FHon, WCLiu, YRommel, CGaillard, PRückle, TSchwarz, MKShokat, KMShaw, JPWilliams, RL The p110 delta structure: mechanisms for selectivity and potency of new PI(3)K inhibitors. Nat Chem Biol6:117-24 (2010) 
 
Phosphatidylinositol 4,5-bisphosphate 3-kinase catalytic subunit delta isoform
Name:Phosphatidylinositol 4,5-bisphosphate 3-kinase catalytic subunit delta isoform
Type:Enzyme Subunit
Mol. Mass.:119489.41
Organism:Homo sapiens (Human)
Description:O00329
Residue:1044
BDBM50323731
NameBDBM50323731
Synonyms:CHEMBL1213117 N-[6-(4-amino-1-{[2-(4-methylpiperazin-1-yl)quinolin-3-yl]methyl}-1H-pyrazolo[3,4-d]pyrimidin-3-yl)-1,3-benzothiazol-2-yl]acetamide | US9790228, Compound 198
TypeSmall organic molecule
Emp. Form.C29H28N10OS
Mol. Mass.564.664
SMILESCN1CCN(CC1)c1nc2ccccc2cc1Cn1nc(-c2ccc3nc(NC(C)=O)sc3c2)c2c(N)ncnc12