Reaction Details
TargetPhosphatidylinositol 4,5-bisphosphate 3-kinase catalytic subunit delta isoform
LigandBDBM50323732
Substrate/Competitorn/a
Meas. Tech.ChEMBL_646802 (CHEMBL1216943)
IC50 0.5±n/a nM
Citation Berndt, AMiller, SWilliams, OLe, DDHouseman, BTPacold, JIGorrec, FHon, WCLiu, YRommel, CGaillard, PRückle, TSchwarz, MKShokat, KMShaw, JPWilliams, RL The p110 delta structure: mechanisms for selectivity and potency of new PI(3)K inhibitors. Nat Chem Biol6:117-24 (2010) 
 
Phosphatidylinositol 4,5-bisphosphate 3-kinase catalytic subunit delta isoform
Name:Phosphatidylinositol 4,5-bisphosphate 3-kinase catalytic subunit delta isoform
Type:Enzyme Subunit
Mol. Mass.:119489.41
Organism:Homo sapiens (Human)
Description:O00329
Residue:1044
BDBM50323732
NameBDBM50323732
Synonyms:3-(2-amino-1,3-benzothiazol-6-yl)-1-{[2-(4-methylpiperazin-1-yl)quinolin-3-yl]methyl}-1H-pyrazolo[3,4-d]pyrimidin-4-amine CHEMBL1213118
TypeSmall organic molecule
Emp. Form.C27H26N10S
Mol. Mass.522.627
SMILESCN1CCN(CC1)c1nc2ccccc2cc1Cn1nc(-c2ccc3nc(N)sc3c2)c2c(N)ncnc12