Reaction Details
TargetPhosphatidylinositol 4,5-bisphosphate 3-kinase catalytic subunit gamma isoform
LigandBDBM50323735
Substrate/Competitorn/a
Meas. Tech.ChEMBL_646801 (CHEMBL1216942)
IC50 10000±n/a nM
Citation Berndt, AMiller, SWilliams, OLe, DDHouseman, BTPacold, JIGorrec, FHon, WCLiu, YRommel, CGaillard, PRückle, TSchwarz, MKShokat, KMShaw, JPWilliams, RL The p110 delta structure: mechanisms for selectivity and potency of new PI(3)K inhibitors. Nat Chem Biol6:117-24 (2010) 
 
Phosphatidylinositol 4,5-bisphosphate 3-kinase catalytic subunit gamma isoform
Name:Phosphatidylinositol 4,5-bisphosphate 3-kinase catalytic subunit gamma isoform
Type:Enzyme Subunit
Mol. Mass.:126470.30
Organism:Homo sapiens (Human)
Description:P48736
Residue:1102
BDBM50323735
NameBDBM50323735
Synonyms:CHEMBL1213168 | N-(3-(3,5-dimethoxyphenylamino)quinoxalin-2-yl)-4-fluorobenzenesulfonamide
TypeSmall organic molecule
Emp. Form.C22H19FN4O4S
Mol. Mass.454.474
SMILESCOc1cc(Nc2nc3ccccc3nc2NS(=O)(=O)c2ccc(F)cc2)cc(OC)c1