Reaction Details
TargetCarbonic anhydrase 2
LigandBDBM50323740
Substrate/Competitorn/a
Meas. Tech.ChEMBL_646954 (CHEMBL1217095)
Ki 34400±n/a nM
Citation Carta, FTemperini, CInnocenti, AScozzafava, AKaila, KSupuran, CT Polyamines inhibit carbonic anhydrases by anchoring to the zinc-coordinated water molecule. J Med Chem53:5511-22 (2010) 
 
Carbonic anhydrase 2
Name:Carbonic anhydrase 2
Type:Enzyme
Mol. Mass.:29250.71
Organism:Homo sapiens (Human)
Description:P00918
Residue:260
BDBM50323740
NameBDBM50323740
Synonyms:CHEMBL303004
TypeSmall organic molecule
Emp. Form.C6H16N2
Mol. Mass.116.2046
SMILESNCCCCCCN