Reaction Details
TargetCarbonic anhydrase 4
LigandBDBM50323740
Substrate/Competitorn/a
Meas. Tech.ChEMBL_646956 (CHEMBL1217097)
Ki 450±n/a nM
Citation Carta, FTemperini, CInnocenti, AScozzafava, AKaila, KSupuran, CT Polyamines inhibit carbonic anhydrases by anchoring to the zinc-coordinated water molecule. J Med Chem53:5511-22 (2010) 
 
Carbonic anhydrase 4
Name:Carbonic anhydrase 4
Type:Enzyme
Mol. Mass.:35037.98
Organism:Homo sapiens (Human)
Description:P22748
Residue:312
BDBM50323740
NameBDBM50323740
Synonyms:CHEMBL303004
TypeSmall organic molecule
Emp. Form.C6H16N2
Mol. Mass.116.2046
SMILESNCCCCCCN