Reaction Details
TargetCarbonic anhydrase 14
LigandBDBM50323740
Substrate/Competitorn/a
Meas. Tech.ChEMBL_646964 (CHEMBL1217105)
Ki 640±n/a nM
Citation Carta, FTemperini, CInnocenti, AScozzafava, AKaila, KSupuran, CT Polyamines inhibit carbonic anhydrases by anchoring to the zinc-coordinated water molecule. J Med Chem53:5511-22 (2010) 
 
Carbonic anhydrase 14
Name:Carbonic anhydrase 14
Type:Enzyme
Mol. Mass.:37665.67
Organism:Homo sapiens (Human)
Description:Human (cloned) isozyme.
Residue:337
BDBM50323740
NameBDBM50323740
Synonyms:CHEMBL303004
TypeSmall organic molecule
Emp. Form.C6H16N2
Mol. Mass.116.2046
SMILESNCCCCCCN