Reaction Details
TargetCarbonic anhydrase 5A, mitochondrial
LigandBDBM50323741
Substrate/Competitorn/a
Meas. Tech.ChEMBL_646957 (CHEMBL1217098)
Ki 44±n/a nM
Citation Carta, FTemperini, CInnocenti, AScozzafava, AKaila, KSupuran, CT Polyamines inhibit carbonic anhydrases by anchoring to the zinc-coordinated water molecule. J Med Chem53:5511-22 (2010) 
 
Carbonic anhydrase 5A, mitochondrial
Name:Carbonic anhydrase 5A, mitochondrial
Type:Enzyme
Mol. Mass.:34755.54
Organism:Homo sapiens (Human)
Description:Human (cloned) isozyme
Residue:305
BDBM50323741
NameBDBM50323741
Synonyms:CHEMBL119296
TypeSmall organic molecule
Emp. Form.C5H14N2
Mol. Mass.102.1781
SMILESNCCCCCN