Reaction Details
TargetCarbonic anhydrase 3
LigandBDBM50323743
Substrate/Competitorn/a
Meas. Tech.ChEMBL_646955 (CHEMBL1217096)
Ki 420±n/a nM
Citation Carta, FTemperini, CInnocenti, AScozzafava, AKaila, KSupuran, CT Polyamines inhibit carbonic anhydrases by anchoring to the zinc-coordinated water molecule. J Med Chem53:5511-22 (2010) 
 
Carbonic anhydrase 3
Name:Carbonic anhydrase 3
Type:Enzyme
Mol. Mass.:29562.11
Organism:Homo sapiens (Human)
Description:Human cloned isozyme.
Residue:260
BDBM50323743
NameBDBM50323743
Synonyms:CHEMBL1214195 | N1-(naphthalen-1-yl)ethane-1,2-diamine
TypeSmall organic molecule
Emp. Form.C12H14N2
Mol. Mass.186.253
SMILESNCCNc1cccc2ccccc12