Reaction Details
TargetCarbonic anhydrase 4
LigandBDBM50323743
Substrate/Competitorn/a
Meas. Tech.ChEMBL_646956 (CHEMBL1217097)
Ki 58±n/a nM
Citation Carta, FTemperini, CInnocenti, AScozzafava, AKaila, KSupuran, CT Polyamines inhibit carbonic anhydrases by anchoring to the zinc-coordinated water molecule. J Med Chem53:5511-22 (2010) 
 
Carbonic anhydrase 4
Name:Carbonic anhydrase 4
Type:Enzyme
Mol. Mass.:35037.98
Organism:Homo sapiens (Human)
Description:P22748
Residue:312
BDBM50323743
NameBDBM50323743
Synonyms:CHEMBL1214195 | N1-(naphthalen-1-yl)ethane-1,2-diamine
TypeSmall organic molecule
Emp. Form.C12H14N2
Mol. Mass.186.253
SMILESNCCNc1cccc2ccccc12