Reaction Details
TargetCarbonic anhydrase 5B, mitochondrial
LigandBDBM50323743
Substrate/Competitorn/a
Meas. Tech.ChEMBL_646958 (CHEMBL1217099)
Ki 61±n/a nM
Citation Carta, FTemperini, CInnocenti, AScozzafava, AKaila, KSupuran, CT Polyamines inhibit carbonic anhydrases by anchoring to the zinc-coordinated water molecule. J Med Chem53:5511-22 (2010) 
 
Carbonic anhydrase 5B, mitochondrial
Name:Carbonic anhydrase 5B, mitochondrial
Type:Enzyme
Mol. Mass.:36440.83
Organism:Homo sapiens (Human)
Description:Human (cloned) isozyme
Residue:317
BDBM50323743
NameBDBM50323743
Synonyms:CHEMBL1214195 | N1-(naphthalen-1-yl)ethane-1,2-diamine
TypeSmall organic molecule
Emp. Form.C12H14N2
Mol. Mass.186.253
SMILESNCCNc1cccc2ccccc12