Reaction Details
TargetCarbonic anhydrase 15
LigandBDBM50323743
Substrate/Competitorn/a
Meas. Tech.ChEMBL_646965 (CHEMBL1217106)
Ki 570±n/a nM
Citation Carta, FTemperini, CInnocenti, AScozzafava, AKaila, KSupuran, CT Polyamines inhibit carbonic anhydrases by anchoring to the zinc-coordinated water molecule. J Med Chem53:5511-22 (2010) 
 
Carbonic anhydrase 15
Name:Carbonic anhydrase 15
Type:PROTEIN
Mol. Mass.:35484.02
Organism:Mus musculus
Description:ChEMBL_651955
Residue:324
BDBM50323743
NameBDBM50323743
Synonyms:CHEMBL1214195 | N1-(naphthalen-1-yl)ethane-1,2-diamine
TypeSmall organic molecule
Emp. Form.C12H14N2
Mol. Mass.186.253
SMILESNCCNc1cccc2ccccc12